Skip to main content
Share Your Experience: Take the 2024 Developer Survey

Questions tagged [runtime-error]

The tag has no usage guidance.

Filter by
Sorted by
Tagged with
0 votes
0 answers
112 views

Moving or copying single character folders names in windows explorer causes explorer crash

I have found a very specific bug in Windows in which folders whose names only have a single character cannot be copied/moved. If I have a folder named 'Q', and in explorer attempt to drag copy or move ...
J Collins's user avatar
  • 678
0 votes
0 answers
243 views

Winzip cmd line gives fatal error

I'm trying to add folders from a mapped network drive into a zip file using winzip command line but everytime I am receiving this error: FATAL ERROR: assert failure (WzZipAdd.c@1346) Please send the ...
ghostanime2001's user avatar
0 votes
1 answer
951 views

Cannot launch modern (UWP) Microsoft Store apps from Start Menu or App Installer (error 0x800700B7)

I came across a rare problem that I cannot solve for a week. This happened to my primary Windows 10 version 21H2 account which happens to be Administrator. Whenever I launch some of modern (UWP) ...
bananakid's user avatar
1 vote
1 answer
111 views

Delphi, Restore, runtime error message,.Delphi

I received an error message during the operation of the program and mistakenly said "do not show more of these types of errors". How can I get this error message back again? Delphi version ...
Harry's user avatar
  • 11
0 votes
0 answers
13 views

Games Recognize C++ Runtime Is Installed For Some Users But Not For Other Users [duplicate]

I have two games that will each run fine for one user on my Windows 10 PC, but another user account encounters these errors whenever trying to run either game. The first game shows this error message ...
Trevor Reid's user avatar
1 vote
0 answers
5k views

RuntimeError: can't start new thread

I'm running into an issue where running multiple instances of the same Python program on my server is causing some of the jobs to throw the following error: File "/home/joe/workspace/...
Anish Sana's user avatar
0 votes
2 answers
663 views

Jupyter does not work without kernel restart after exception

I need to kill and restart the kernel of Jupyter upon encountering an exception in the code. Otherwise, none of the cells will execute. This happens with any script, i.e. it can be something as simple ...
borisbundschuh's user avatar
14 votes
5 answers
221k views

How to solve “Unable to locate a Java Runtime that supports” error?

I am trying to run a java-based program called Caver analyst on MacOS BigSur 11.2.3 When I click on the Unix executable file, a terminal window pops up with the following message: /Users/amir/Desktop/...
amiro's user avatar
  • 141
1 vote
2 answers
1k views

Not charging while laptop in use otherwise charging

My laptop brand and number is (HP-ac124TX), laptop is charging well (orange light) when the laptop is not turned on and as soon as I'm turning it on it is not charging (white light), as matter of fact ...
Shubham Sharma's user avatar
1 vote
0 answers
70 views

Make windows automatically start an application again when it suddenly closed

I have windows form application running in Windows, but it sometimes crashes randomly. Can we set it to automatically run again when it it closed? I need the application to always be running.
Abraham Putra Prakasa's user avatar
0 votes
1 answer
1k views

Keep getting "Index out of range" error

So I primarily use java and C++ and VBA is very new to me. I'm very confused as to why I keep getting error 9 - "Index out of range". Here is the code: Dim count As Integer Dim j As Integer ...
JeRunEnChaussettes's user avatar
1 vote
2 answers
6k views

The port 55283 was occupied" errors comes whenever I use ShareIt

Today I installed ShareIt Windows software from ShareIt official site. Software installed correctly without any issue, but when I opened it, I am getting prompt "The port 55283 was occupied". I want ...
Salman Dalal's user avatar
1 vote
2 answers
1k views

Excel: VBA Calculation giving error on "blank" cell

My VBA calculation on sheet "$$$" in column L gives a "Runtime error 13: Type mismatch" when I run it, using the "original calculate balance" button. This is confusing because this has worked for ...
mechengr02's user avatar
1 vote
1 answer
176 views

Firefox closes suddenly

I am experiencing a rather strange issue with my Firefox browser. It just closes without any notice, and even the crash prompt or window doesn't show up even though I have set it so that it should ...
JackBixuis's user avatar
1 vote
1 answer
609 views

Why do I get this code 139 error (signal 11: SIGSEGV), and what can I do about it?

I've recently upgraded to Mac OS Catalina and my project that I have been working on keeps getting interrupted by this new error before any of the main code runs: Process finished with exit code ...
TJR's user avatar
  • 11
1 vote
1 answer
152 views

Error at launching eclipse

everyone! I have recently set up an Ubuntu partition on my laptop, and installed the open-jdk version "11.0.4". Afterwards, I "apt-got" eclipse straight from the Ubuntu repo, but on startup I get ...
Franz Ribcek's user avatar
0 votes
1 answer
2k views

Using Latex in Inkscape 1.0 Beta on macOS Catalina

I recently updated my MacOS to Catalina, with that, Inkscape 0.92.2 using XQuartz or X11 stopped working. Since I use Inkscape to make all my figures for conference papers and things like that, I ...
RoryHector's user avatar
1 vote
0 answers
170 views

blob.cpp: Check failed: count_ == proto.data_size() (1 vs. 0)

I was trying to run a sample Caffe code from a git repo. I installed Caffe on my Ubuntu 18.04 (with apt-get install libcaffe-cpu-dev), and compiled this repo code and DeepVideoSummExample executable ...
Tina J's user avatar
  • 539
0 votes
2 answers
39 views

3D chat software crash error

One 3D chat software is crashing in Windows 10. While checking the log, I got this line: TaskScheduler.pyo(292) ERROR: Going to bubble out of event pump What does this mean? Can this be the ...
Noshin Tabassum's user avatar
-2 votes
1 answer
31 views

3D chat software crash

One 3D chat software is crashing in Windows 10. While checking the log, I got this line: flashPlayerTrust directory probably already exists - os.makedirs exception: WindowsError(183, 'Cannot create ...
Noshin Tabassum's user avatar
0 votes
0 answers
248 views

Ruby Mine debugger doesnt start of error SIGABRT

I am facing an error when trying to execute a rails app in debug mode. I have an error which is saying: Process finished with exit code 134 (interrupted by signal 6: SIGABRT) I've seen that I don't ...
Sona's user avatar
  • 1
0 votes
0 answers
79 views

Quarantine message upon compiling in Dev C++

I have newly setup Dev c++ in my laptop in excitement of ditching Turbo C++ for this more intermediate IDE to use for practice purposes... I'm quite new to this IDE and just went off exploring about ...
Anupam Dash's user avatar
1 vote
0 answers
2k views

After updating Android Studio I got this error

FAILURE: Build failed with an exception. What went wrong: Execution failed for task ':app:mergeDebugResources'. 8 exceptions were raised by workers: com.android.builder.internal.aapt.v2....
Abhishek Tiwary's user avatar
0 votes
1 answer
149 views

Excel run time 429 error on all computers

Error " Active x component can't create object" Was working until a few weeks back. Now doesn't work on any computer - the workbook hasn't changed and no version of it works. Using office 360 ...
user1061881's user avatar
2 votes
2 answers
8k views

Compatibility issues with a VB6 app on Windows 10

The big problem In the organization where I work, the management system (a modular application created by another company) was developed in the year 97/98 on VB, and has never migrated to another ...
Noir's user avatar
  • 123
0 votes
1 answer
222 views

"DEBUG" Error when installing any new packages in python via Anaconda Powershell Prompt

When I attempt to install packages via the conda install command (e.g. conda install rasterio) I receive a ridiculous looking debugging error in the powershell prompt. It ultimately tells me that ...
EricR's user avatar
  • 1
0 votes
1 answer
270 views

Android Studio Gradle sync error

I installed Android 3.3 and upgraded it to version 4.10.1. Now I'm going to run one of the default activities. But when it comes to sync the Gradle, it shows me this message: What should I do? please ...
user1047268's user avatar
0 votes
1 answer
106 views

Error in flutter update on Mac

Error in flutter update on Mac # # Error in flutter update on Mac ## When trying to update Flutter using the "sudo flutter upgrade" command. It has been updated correctly without errors, however ...
Israel Wilson's user avatar
0 votes
1 answer
1k views

Sonarqube 7.7 installation in Windows

Got the following error: 2019.04.25 22:53:05 INFO web[][o.s.p.ProcessEntryPoint] Starting web 2019.04.25 22:53:05 ERROR web[][o.s.s.a.EmbeddedTomcat] Fail to start web server org.apache.catalina....
user1027762's user avatar
1 vote
0 answers
398 views

RecursionError occurs with every attempted Anaconda package update / installation

I recently have seen the same 'RecursionError: maximum recursion depth exceeded' message when I attempt to update existing packages or when installing new packages. For example, conda install -c ...
Erin K's user avatar
  • 11
3 votes
2 answers
7k views

Visual Studio Code : Error 5 : An error occurred while trying to create a file in the destination directory

I have Microsoft Visual Studio Code version 1.31.1 running in my Windows 8.1, 64 bit machine. Time to time it prompts me this error. When I press "Abort" the window gets closed. When I press "...
Ishara Amarasekera's user avatar
1 vote
2 answers
5k views

COMODO antivirus : Getting message “Security agent could not be started” after uninstallation

I had COMODO antivirus installed in my Windows 8.1, 64 bit machine. I recently uninstalled it. But whenever I restart my machine it always prompts me this error message. Does it mean the ...
Ishara Amarasekera's user avatar
3 votes
2 answers
4k views

Causes of Error 35602: Key is not unique in collection

When attempting to simulate or compile a PLD file on WinCupl, I get the error: Error '35602': Key is not unique in collection. after which the program crashes and closes. What is the meaning of an ...
Jonathan Lam's user avatar
0 votes
1 answer
954 views

Windows 8.1 "PC Settings" is giving a Runtime Library Error on opening

I wanted to open PC settings on my Windows 8.1, and suddenly an error message popped up: it's a Visual C++ Runtime error. PC settings successfully opened, but it made an error sound. So I went back to ...
TheRealSuicune's user avatar
1 vote
0 answers
31 views

Linux Mint 19v1 how to change the behaviour of K3b with a blank DVD in a removable drive?

This is a fresh install of Linux Mint 19v1 Tessa The system asks what do you want to do with a blank disk? I choose "Run K3b" as this is logical but... While running K3b to make several copies of a ...
Alexandra Crawford's user avatar
2 votes
0 answers
259 views

Error when connect RSU to OpenFlow Switch in OMNeT++

I want to simulate a VANET based Software Defined Network (SDN). I successfully integrated SUMO with OMNeT++ using Veins. Then I imported INET, OpenFlow. An error appears when I added gates to the ...
Alia 's user avatar
  • 21
0 votes
0 answers
225 views

How do I get back the "... has stopped working" message box?

I have a console application that will crash as soon as it is started, but display some very useful information (for my debugging) before it terminates. I used to launch this application on Windows 8....
O. R. Mapper's user avatar
7 votes
3 answers
16k views

Getting Unchecked runtime.lastError on chrome whenever moving the mouse

I've noticed that I get the following error on Chrome now (not yet sure whether it happens on other browsers): Whenever I move the mouse, it logs this error in the console: Unchecked runtime....
Umar Ghouse's user avatar
0 votes
1 answer
712 views

How to install Visual Studio 2017 Community Edition on Windows 10 Home "S"

Windows 10 Home S only installs apps that are verified for the Microsoft Store. For example, Arduino IDE installed just fine. I'd expect all Microsoft products to be verified for sure. However, I'...
JustBeingHelpful's user avatar
3 votes
0 answers
6k views

7zip error codes

While trying to extract a file from a split archive, it failed consistently at 61% with Unknown error -2147024891 This error code seems to appear only a single other time anywhere, here. And there ...
Fabian Röling's user avatar
0 votes
1 answer
678 views

driver to fix "module ABI major version (1) doesn't match the server's version (5)" error

I have just upgraded from Slackware 12 to Slackware 13 (Linux) due to websites upgrading and the need for new browsers. But now I ran into a problem. It seems I can use the standard vesa driver to ...
Mike -- No longer here's user avatar
0 votes
1 answer
2k views

Runtime Error 91- Excel VBA

I'm new to VBA and having an issue with the below code, each time any cell (other than one in Column G) is selected the following error appears; "Runtime error 91 - Object varible or with block ...
P Hope's user avatar
  • 15
0 votes
3 answers
172 views

Excel VBA error management

I read this thread on error handling, but when I try to replicate even a simple error management scenario it won't work. I'm trying to run the following modified code from one of the examples: Sub ...
WestWindsDemon's user avatar
0 votes
1 answer
4k views

VBA error 1004 while exporting to PDF

Hi Guys I really need assistance with the below code. I am using the following codes to import data into Excel: Option Explicit Private Sub CommandButton1_Click() Const FULL_PATH = "C:\Users\...
gist102's user avatar
  • 25
4 votes
2 answers
7k views

npm install can't access folder (no Permission)

i'm trying to install storjshare-daemon on ubuntu and i'm following the guide but when i'm using npm it keeps showing the same error , i try everything like setting public key on github and Check ...
y.h.'s user avatar
  • 45
0 votes
0 answers
5k views

collect2: error: ld returned 1 exit status Makefile:107: recipe for target ‘binary’ failed make: *** [binary] Error 1

I am trying to compile ChatScript V7.55 on Ubuntu 16.04 but I got this error message: collect2: error: ld returned 1 exit status Makefile:107: recipe for target ‘binary’ failed make: *** [binary] ...
user3486308's user avatar
0 votes
0 answers
1k views

Run-Time Error 1004: MS Excel is refreshing some data. Please try again later using Query

I have a dynamic query in a sheet that has a parameter in cell C1. So, In column A there are codes, and in column b are those code descriptions and based on the value in cell C1, the query will ...
anve's user avatar
  • 33
1 vote
0 answers
89 views

Application/object error during paste special operation

I have been working in this code for a week now, I'm kind of new to VBA and am close to getting it to do what I need it to but I keep getting a "Aplication-defined or object-defined error" on the last ...
LifeisWild's user avatar
0 votes
1 answer
1k views

Why am I getting this error in "pip install ephem"?

xcrun: error: invalid active developer path (/Library/Developer/CommandLineTools), missing xcrun at: /Library/Developer/CommandLineTools/usr/bin/xcrun error: command '/usr/bin/clang' failed with exit ...
JobHunter69's user avatar
0 votes
1 answer
2k views

Object expected Microsoft JScript runtime error 800A138F when viewing diffs inside of TortoiseSVN update log

After I get an update, I double click a JavaScript file in my update log and get the following error message: I've tried clearing everything inside of Settings -> Saved Data but I still get errors. I'...
thecoolmacdude's user avatar